{"text_format":"1","workbook":"xlsx","n_sheets":6,"sheets":["APU Profile Form","checklist","Roster","APU Master","FY25-FY26 Scales","APU Scale"],"not_rendered":{"charts":0,"images":0,"macros":1,"external_links":9,"defined_names":129,"comments":3,"pivot_tables":0},"unopened":[],"bounds":{"document_bytes":16777216,"sheet_cells":100000,"rows_first":2000,"rows_last":500,"rows_between":2000,"halvings":0,"cell_chars":16384,"cell_head_chars":4096},"cells_cut":0,"cells_raw":0,"read":"whole","date_system":"1900"}

{"sheet":"APU Profile Form","index":0,"n_rows":198,"n_cols":14,"rows_kept":198,"cut":false,"hidden":false,"merged":[[11,2,19,10],[0,2,0,10],[2,3,2,8],[4,3,4,8],[6,3,6,8],[8,3,8,8]]}
[null,null,"ACADEMIC PROGRAM UNIT PROFILE"]
[]
[null,null,"DEPARTMENT:",{"$f":"Roster!C10","v":0}]
[]
[null,null,"APU NAME:",{"$f":"VLOOKUP(D7,'APU Master'!B:D,3,FALSE)","v":"Orthopaedic Surgery Non-Surgical Faculty "}]
[]
[null,null,"APU CODE:",{"$f":"Roster!A10","v":"ORT006"}]
[]
[null,null,"DATE SUBMITTED:",{"$f":"TODAY()","v":"2026-04-27"}]
[]
[null,null,"Description of APU:  Please include criteria used."]
[null,null,{"$f":"VLOOKUP(D7,'APU Master'!B:E,4,FALSE)","v":"UCSD Orthopaedic Surgery faculty whose primary function is procedures and the non‐surgical care of patients."}]
[]
[]
[]
[]
[]
[]
[]
[]
{"$rows_left_out":179}
{"sheet":"checklist","index":1,"n_rows":19,"n_cols":2,"rows_kept":19,"cut":false,"hidden":false,"merged":[]}
["Checklist to review before sending for Dean's or VC's approval:"]
[]
[]
["APU profile form:"]
[null,"add all Faculty that belong to the code (including all the new Faculty appointments started during the current/prior FY)"]
[null,"remove all Faculty that no longer belong to the code"]
[null,"make sure all salary are based on the current, approved rank, step, and HSCP salary scales (do not use projected info)"]
[null,"* if APU scale is being changed for the APU code -> calculate the X', offscale, and Y based on the changed APU scale for ALL Faculty being listed"]
[null,"* if Faculty is being added to the APU code  -> calculate the X', offscale, and Y based on the changed APU scale for the newly added Faculty only"]
[null,"review to see if any APU code has fewer than 5 members, if so, this will be a compliance issue and department will need to provide justification in the memo to ask for the exceptional approval "]
[]
[]
["Chair's memo needs to include the following info:"]
[null,"list of all the changes being requested"]
[null,"justification for the requested changes"]
[null,"confirmation that all APU members are in good standing"]
[null,"confirmation that the department accepts 415(m) liability that may result"]
[null,"confirmation that the APU will be able to maintain the covered compensation rate for at least 3 years"]
[null,"if any APU code has fewer than 5 members, need to provide justification in the memo to ask for the exceptional approval "]

{"sheet":"Roster","index":2,"n_rows":300,"n_cols":16,"rows_kept":300,"cut":false,"hidden":false,"merged":[[7,10,7,14],[7,0,7,1],[7,2,7,9]]}
["I N S T R U C T I O N S :"]
["1. Click the",null,"button on the Roster tab, to clear existing data and prepare the form for entry.",null,null,null,null,null,"6. Paste Values (V) into the section highlighted yellow below (starting in Cell C10)."]
["2. In ARC ServiceNow, go to ARC Report Library > Compensation Reports > APU Profile Form.",null,null,null,null,null,null,null,"7. Type in the APU Code in Cell A10 and the APU Scale in Cell B10 (highlighted orange)."]
["3. In the APU Name Search box, type in the desired APU Code and hit Enter.",null,null,null,null,null,null,null,"7. Delete employees moving out of the APU and add employees moving into the APU."]
["4. Right click anywhere in the headers, go to the Export menu and select Excel (.xlsx).",null,null,null,null,null,null,null,"8. Sort Column D (AIR Profile) A to Z, so faculty members appear in alphabetical order."]
["5. Copy all data from the exported spreadsheet in Column C through Column J, starting at Row 2.",null,null,null,null,null,null,null,"10. On the APU Profile Form, hide all the blank linge and highlight the rows with new faculty."]
[]
["MANUAL  -  MANUAL",null,"A I R E L    -    A I R E L    -    A I R E L    -    A I R E L    -    A I R E L    -    A I R E L    -    A I R E L    -   A I R E L    -    A I R E L",null,null,null,null,null,null,null,"CALCULATED   -   CALCULATED   -   CALCULATED   -   CALCULATED"]
["APU Code","APU Scale","Department","AIR Profile","Rank","Step","Base (X)","Off Scale X","Total Negotiated (100%)","Stipend","Base (X)","X'","Total Off-Scale (X+X')","Total Covered Comp","Y","RankStepScale"]
["ORT006",null,null,null,null,null,null,null,null,null,{"$f":"IFERROR(VLOOKUP(P10,'FY25-FY26 Scales'!A:J,10,FALSE),G10)","v":0},{"$f":"IFERROR(VLOOKUP(P10,'FY25-FY26 Scales'!A:K,11,FALSE),ROUND(G10*VLOOKUP(B10*1,'APU Scale'!A:B,2,FALSE)-G10,-2))","v":0},{"$f":"ROUND(H10*VLOOKUP(B10*1,'APU Scale'!A:B,2,FALSE),-2)","v":0},{"$f":"K10+L10+M10","v":0},{"$f":"IF(I10-J10-N10<0,0,I10-J10-N10)","v":0},{"$f":"CONCATENATE(E10,F10,B10)","v":""}]
[{"$f":"A10","v":"ORT006"},{"$f":"B10","v":0},null,null,null,null,null,null,null,null,{"$f":"IFERROR(VLOOKUP(P11,'FY25-FY26 Scales'!A:J,10,FALSE),G11)","v":0},{"$f":"IFERROR(VLOOKUP(P11,'FY25-FY26 Scales'!A:K,11,FALSE),ROUND(G11*VLOOKUP(B11*1,'APU Scale'!A:B,2,FALSE)-G11,-2))","v":0},{"$f":"ROUND(H11*VLOOKUP(B11*1,'APU Scale'!A:B,2,FALSE),-2)","v":0},0,0,"0"]
["ORT006",0,null,null,null,null,null,null,null,null,{"$f":"IFERROR(VLOOKUP(P12,'FY25-FY26 Scales'!A:J,10,FALSE),G12)","v":0},{"$f":"IFERROR(VLOOKUP(P12,'FY25-FY26 Scales'!A:K,11,FALSE),ROUND(G12*VLOOKUP(B12*1,'APU Scale'!A:B,2,FALSE)-G12,-2))","v":0},{"$f":"ROUND(H12*VLOOKUP(B12*1,'APU Scale'!A:B,2,FALSE),-2)","v":0},0,0,"0"]
["ORT006",0,null,null,null,null,null,null,null,null,{"$f":"IFERROR(VLOOKUP(P13,'FY25-FY26 Scales'!A:J,10,FALSE),G13)","v":0},{"$f":"IFERROR(VLOOKUP(P13,'FY25-FY26 Scales'!A:K,11,FALSE),ROUND(G13*VLOOKUP(B13*1,'APU Scale'!A:B,2,FALSE)-G13,-2))","v":0},{"$f":"ROUND(H13*VLOOKUP(B13*1,'APU Scale'!A:B,2,FALSE),-2)","v":0},0,0,"0"]
["ORT006",0,null,null,null,null,null,null,null,null,{"$f":"IFERROR(VLOOKUP(P14,'FY25-FY26 Scales'!A:J,10,FALSE),G14)","v":0},{"$f":"IFERROR(VLOOKUP(P14,'FY25-FY26 Scales'!A:K,11,FALSE),ROUND(G14*VLOOKUP(B14*1,'APU Scale'!A:B,2,FALSE)-G14,-2))","v":0},{"$f":"ROUND(H14*VLOOKUP(B14*1,'APU Scale'!A:B,2,FALSE),-2)","v":0},0,0,"0"]
["ORT006",0,null,null,null,null,null,null,null,null,{"$f":"IFERROR(VLOOKUP(P15,'FY25-FY26 Scales'!A:J,10,FALSE),G15)","v":0},{"$f":"IFERROR(VLOOKUP(P15,'FY25-FY26 Scales'!A:K,11,FALSE),ROUND(G15*VLOOKUP(B15*1,'APU Scale'!A:B,2,FALSE)-G15,-2))","v":0},{"$f":"ROUND(H15*VLOOKUP(B15*1,'APU Scale'!A:B,2,FALSE),-2)","v":0},0,0,"0"]
["ORT006",0,null,null,null,null,null,null,null,null,{"$f":"IFERROR(VLOOKUP(P16,'FY25-FY26 Scales'!A:J,10,FALSE),G16)","v":0},{"$f":"IFERROR(VLOOKUP(P16,'FY25-FY26 Scales'!A:K,11,FALSE),ROUND(G16*VLOOKUP(B16*1,'APU Scale'!A:B,2,FALSE)-G16,-2))","v":0},{"$f":"ROUND(H16*VLOOKUP(B16*1,'APU Scale'!A:B,2,FALSE),-2)","v":0},0,0,"0"]
["ORT006",0,null,null,null,null,null,null,null,null,{"$f":"IFERROR(VLOOKUP(P17,'FY25-FY26 Scales'!A:J,10,FALSE),G17)","v":0},{"$f":"IFERROR(VLOOKUP(P17,'FY25-FY26 Scales'!A:K,11,FALSE),ROUND(G17*VLOOKUP(B17*1,'APU Scale'!A:B,2,FALSE)-G17,-2))","v":0},{"$f":"ROUND(H17*VLOOKUP(B17*1,'APU Scale'!A:B,2,FALSE),-2)","v":0},0,0,"0"]
["ORT006",0,null,null,null,null,null,null,null,null,{"$f":"IFERROR(VLOOKUP(P18,'FY25-FY26 Scales'!A:J,10,FALSE),G18)","v":0},{"$f":"IFERROR(VLOOKUP(P18,'FY25-FY26 Scales'!A:K,11,FALSE),ROUND(G18*VLOOKUP(B18*1,'APU Scale'!A:B,2,FALSE)-G18,-2))","v":0},{"$f":"ROUND(H18*VLOOKUP(B18*1,'APU Scale'!A:B,2,FALSE),-2)","v":0},0,0,"0"]
["ORT006",0,null,null,null,null,null,null,null,null,{"$f":"IFERROR(VLOOKUP(P19,'FY25-FY26 Scales'!A:J,10,FALSE),G19)","v":0},{"$f":"IFERROR(VLOOKUP(P19,'FY25-FY26 Scales'!A:K,11,FALSE),ROUND(G19*VLOOKUP(B19*1,'APU Scale'!A:B,2,FALSE)-G19,-2))","v":0},{"$f":"ROUND(H19*VLOOKUP(B19*1,'APU Scale'!A:B,2,FALSE),-2)","v":0},0,0,"0"]
["ORT006",0,null,null,null,null,null,null,null,null,{"$f":"IFERROR(VLOOKUP(P20,'FY25-FY26 Scales'!A:J,10,FALSE),G20)","v":0},{"$f":"IFERROR(VLOOKUP(P20,'FY25-FY26 Scales'!A:K,11,FALSE),ROUND(G20*VLOOKUP(B20*1,'APU Scale'!A:B,2,FALSE)-G20,-2))","v":0},{"$f":"ROUND(H20*VLOOKUP(B20*1,'APU Scale'!A:B,2,FALSE),-2)","v":0},0,0,"0"]
{"$rows_left_out":281}
{"sheet":"APU Master","index":3,"n_rows":92,"n_cols":22,"rows_kept":92,"cut":false,"hidden":true,"merged":[[2,5,2,9],[2,10,2,16],[2,17,2,21]]}
["Updated 4/24/2026"]
["APU Master List"]
[null,null,null,null,null,"EFFECTIVE UP UNTIL 7/1/23",null,null,null,null,"CHANGES EFFECTIVE 7/1/24",null,null,null,null,null,null,"EFFECTIVE UP UNTIL 7/1/24"]
["Department/School","APU Code","Scale","APU Name","APU Definition","APU profile form - last approved","Effective ","Memo (Y/N)","APU profile form (Y/N)","ARC case # (PRIOR TO 7/1/24)","ARC case #","Change Requested (brief description)","Memo - provided (Y/N)","APU profile form signed (Y/N - if N, who is pending)","Dean/VC approval (Y/N)","Date","Note","APU profile form - last approved - 2024","Effective - as of 2024","Memo (Y/N) - as of 2024","APU profile form (Y/N) - as of 2024","ARC case # - as of 2024"]
["Anesthesiology","ANE001",5,"Anesthesiology Clinical Faculty","All clinical faculty members in department.","2022-01-14","2021-07-01","N","Y","ARC0308941",null,null,null,null,null,null,null,"2022-01-14","2021-07-01","N","Y","ARC0308941"]
["Cellular & Molecular Medicine","CMM001",4,"Cellular & Molecular Medicine","Faculty with primary appointment in the Department of Cellular and Molecular Medicine.","N","N","N","N","N","ARC0372779","no change - replacing expired","N/A","Y","Y","2024-04-26","Approved","2024-04-26","2024-07-01","N/A","Y","ARC0372779"]
["Dermatology ","MED043",3,"Dermatology Clinical Faculty","Clinically active faculty members in the Division of Dermatology.","N","N","N","N","N",null,null,null,null,null,null,null,"N","N","N","N","N"]
["Dermatology ","PEDDER",7,"Dermatology  ","Pediatric Derm faculty hired under the Department of Pediatrics before the establishment of the Department of Dermatology in 2015.  Peds Derm faculty hired post department establishment are at APU 3 to align with Adult Derm faculty.","N","N","N","N","N","ARC0372708","no change - replacing expired","N/A","N","N","2024-06-12","pending dept.","N","N","N","N","N"]
["Emergency Medicine","EMS001",7,"DEM Faculty Leadership (EMS)","All faculty board certified in Emergency Medicine with active clinical, teaching, and scholarly profiles and have current major administrative and academic leadership positions or responsibilities, and must be long term positions within the department (e.g., Chair, Vice Chair, etc.).","N","N","N","N","N","ARC0372721","changed description (All faculty board certified in Emergency Medicine with active clinical, teaching, and scholarly profiles and have current major administrative and academic leadership positions or responsibilities, and must be long term positions within the department (e.g., Chair, Vice Chair, etc.)","Y","Y","Y","2024-06-11","Approved","2024-06-11","2024-07-01","Y","Y","ARC0372721"]
["Emergency Medicine","EMS002",6,"DEM Faculty (EMS)","Full-time EMS faculty carrying full clinical responsibility along with teaching and scholarly productivity requirements.","N","N","N","N","N","ARC0372721","changed description (Full-time EMS faculty carrying full clinical responsibility along with teaching and scholarly productivity requirements.)","Y","Y","Y","2024-06-12","Approved","2024-06-12","2024-07-01","Y","Y","ARC0372721"]
["Family Medicine","FPM001",5,"Family Medicine Physician and Leadership Faculty","All department faculty with medical doctoral degree (e.g. MD, DO) and/or Vice Chairs and Division Chiefs with or without medical doctoral degree (e.g. MD, DO, PhD, PsyD).","2022-04-07","2022-07-01","Y","Y","ARC0326004","ARC0372714","change name + definition (All department faculty with medical doctoral degree (e.g. MD, DO) and/or current Vice Chairs and Division Chiefs with or without medical doctoral degree (e.g. MD, DO, PhD, PsyD.) - affecting Drs. Sieber and Tai-Seale (FPM002 to FPM001)","Y","Y","Y","2024-06-11","Approved","2024-06-11","2024-07-01","Y","Y","ARC0372714"]
["Family Medicine","FPM002",3,"Family Medicine Non-Physician Faculty","All department faculty with non-medical doctoral degrees (e.g. PhD, PsyD).","2022-04-07","2022-07-01","Y","Y","ARC0326005","ARC0372714","change name + definition + has less than 5 members so require VC exceptional approval","Y","Y","Y","2024-06-11","Approved","2024-06-11","2024-07-01","Y","Y","ARC0372714"]
["Family Medicine","FPM003",5,"Family Medicine PACE Faculty","All department faculty who are PACE (Physician Assessment Clinical Ed) Program faculty directors.","2022-04-07","2022-07-01","Y","Y","ARC0326006","ARC0372714","change name + definition ","Y","Y","Y","2024-06-11","Approved","2024-06-11","2024-07-01","Y","Y","ARC0372714"]
["Medicine","MED031",3,"Genomics & Precision Medicine Faculty","Clinically active and Research faculty members in the Division of Genomics & Precision Medicine.","2023-05-12","2023-07-01","N","Y","N","ARC0370194","changed APU name + description to reflect new division name (Genomics & Precision Medicine Faculty - Clinically active and Research faculty members in the Division of Genomics & Precision Medicine.)","Y","Y","Y","2024-04-22","Approved","2024-04-22","2024-07-01","Y","Y","ARC0370194"]
["Medicine","MED041",3,"Bone Marrow Transplantation Faculty","Clinically active faculty members in the Division of Bone Marrow Transplant.","2023-05-12","2023-07-01","Y","Y","N","ARC0372870","various Faculty changing APU","N","N","N","2024-04-22","pending dept.","2023-05-12","2023-07-01","Y","Y","N"]
["Medicine","MED042",3,"Cardiovascular Medicine Clinical & Research Faculty","Clinically active and Research faculty members in the Division of Cardiovascular Medicine.","2023-05-12","2023-07-01","Y","Y","N","ARC0372870","various Faculty changing APU","N","N","N","2024-04-22","pending dept.","2023-05-12","2023-07-01","Y","Y","N"]
["Medicine","MED044",3,"Endocrinology/Metabolism Clinical & Research Faculty","Clinically active and Research faculty members in the Division of Endocrinology/Metabolism.","2023-05-12","2023-07-01","Y","Y","N","ARC0372870","various Faculty changing APU","N","N","N","2024-04-22","pending dept.","2023-05-12","2023-07-01","Y","Y","N"]
["Medicine","MED045",3,"Gastroenterology/Hepatology Clinical & Research Faculty","Clinically  active and Research faculty members in the Division of Gastroenterology/Hepatology.","2023-05-12","2023-07-01","Y","Y","ARC0351533","ARC0372870","various Faculty changing APU","N","N","N","2024-04-22","pending dept.","2023-05-12","2023-07-01","Y","Y","ARC0351533"]
["Medicine","MED046",3,"General Internal Medicine Clinical & Research Faculty","Clinically active and Research faculty members in the Division of General Internal Medicine.","2023-05-12","2023-07-01","Y","Y","N","ARC0372870","various Faculty changing APU","N","N","N","2024-04-22","pending dept.","2023-05-12","2023-07-01","Y","Y","N"]
["Medicine","MED048",3,"Hematology/Oncology Clinical & Research Faculty","Clinically active and Research faculty members in the Division of Hematology/Oncology.","2023-05-12","2023-07-01","Y","Y","N","ARC0372870","various Faculty changing APU","N","N","N","2024-04-22","pending dept.","2023-05-12","2023-07-01","Y","Y","N"]
{"$rows_left_out":73}
{"sheet":"FY25-FY26 Scales","index":4,"n_rows":204,"n_cols":12,"rows_kept":204,"cut":false,"hidden":true,"merged":[]}
["USE THIS TO VERIFY the X, X', and covered comp"]
["* May want to replace \"Full\" with \"Full to match the APU profile"]
[]
["Concatenate (roman numero + user \"Full\" instead of \"Full\")","Step (roman numero)","Concatenate","APU","Rank","Step","07/01 X","07/01 X' actual","07/01 Covered Comp","10/01 X","10/01 X' actual","10/01 Covered Comp"]
[{"$f":"CONCATENATE(E5,B5,D5)","v":"AssistantI0"},{"$f":"ROMAN(F5)","v":"I"},{"$f":"CONCATENATE(E5,F5,D5)","v":"Assistant10"},0,"Assistant",1,93700,0,{"$f":"SUM(G5:H5)","v":93700},93700,0,{"$f":"SUM(J5:K5)","v":93700}]
[{"$f":"CONCATENATE(E6,B6,D6)","v":"AssistantII0"},{"$f":"ROMAN(F6)","v":"II"},{"$f":"CONCATENATE(E6,F6,D6)","v":"Assistant20"},0,"Assistant",2,98500,0,{"$f":"SUM(G6:H6)","v":98500},98500,0,{"$f":"SUM(J6:K6)","v":98500}]
[{"$f":"CONCATENATE(E7,B7,D7)","v":"AssistantIII0"},"III","Assistant30",0,"Assistant",3,103800,0,103800,103800,0,103800]
["AssistantIV0","IV","Assistant40",0,"Assistant",4,109400,0,109400,109400,0,109400]
["AssistantV0","V","Assistant50",0,"Assistant",5,115400,0,115400,115400,0,115400]
["AssistantVI0","VI","Assistant60",0,"Assistant",6,121400,0,121400,121400,0,121400]
["AssociateI0","I","Associate10",0,"Associate",1,115500,0,115500,115500,0,115500]
["AssociateII0","II","Associate20",0,"Associate",2,121500,0,121500,121500,0,121500]
["AssociateIII0","III","Associate30",0,"Associate",3,127900,0,127900,127900,0,127900]
["AssociateIV0","IV","Associate40",0,"Associate",4,135100,0,135100,135100,0,135100]
["AssociateV0","V","Associate50",0,"Associate",5,145700,0,145700,145700,0,145700]
["FullI0","I","Full10",0,"Full",1,135200,0,135200,135200,0,135200]
["FullII0","II","Full20",0,"Full",2,145800,0,145800,145800,0,145800]
["FullIII0","III","Full30",0,"Full",3,157000,0,157000,157000,0,157000]
["FullIV0","IV","Full40",0,"Full",4,168900,0,168900,168900,0,168900]
["FullV0","V","Full50",0,"Full",5,181600,0,181600,181600,0,181600]
{"$rows_left_out":185}
{"sheet":"APU Scale","index":5,"n_rows":11,"n_cols":2,"rows_kept":11,"cut":false,"hidden":true,"merged":[]}
["Scale","Multiplier"]
[0,1]
[1,1.1000000000000001]
[2,1.2]
[3,1.3]
[4,1.4]
[5,1.5]
[6,1.65]
[7,1.8]
[8,2]
[9,2.25]